IhavetestedpositiveforCOVID19,IhaveexperiencedthesymptomsofCOVID19persistentcoughorhighbodytem,IhaveaclosefriendwhotestedpositiveforCOVID19,IknowsomeonewhodiedfromCOVID19,IhavehadtoselfisolatebecauseIhavesymptomsofCOVID19beforeoraftert,Inwhatyearwereyouborn,Whatisyourcountryofresidence,Education,Whatisyourcurrentworkstatus,Doyouhavemedicalinsurance,Whatisyourcurrentrelationshipstatus,WhatsexwereyouassignedatbirthForexamplelistedonyourbirthcertific,Whatisyourcurrentgender,Whatisyoursexualorientation,None_Medicalconditions,Anxiety,Arthritis,Asthma,Brokenbonesorfractures,Cancer,Depression,Dermatologicalproblems,Diabetes,Difficultyeatingbathingdressingtoiletingormovingaroundbyyourself,Hearingloss,Heartcondition,Hepatitis,HerpesHerpessimplex,Highbloodpressure,HIV,Kidneyconditions,Malaria,Migraines,Neurologicalproblems,Pneumonia,Respiratoryproblems,Severeallergy,ShinglesHerpesZoster,STIsexuallytransmittedinfectionssuchasgonorrheasyphilisclamydia,Stroke,Urinarytractinfections,Visionloss,Rememberingthenameofthepersonjustintroducedtoyou,Radiotelevisionsystemzipcodenumberthatwe,Recallingwhereyouhaveputobjectssuchaskeys,Rememberingfratcsfromaninternetarticleorothers,Rememberingtheitemsyouintendedtobuywhenyouarriveatashoporpharmac,Ingeneralhowwouldyoudescribeyourmemoryascomparedto5yearsago,Imadenochangestomylifeorbehavior,Physicaldistancing,Isolationorselfquarantine,Wearingmasksorfacecoverings,Washingmyhandsorsanitizingmyhandsmoreoften,Caringforsomeoneathome,Workingfromhome,VolunteeringmytimeskillsresourcesordonatingmoneytohelpfightCOVID,FollowingmediacoveragerelatedtoCOVID19e.g.watchingorreadingthene,Chaneinworkstatus,Changeinuseofhealthservices,Changeintravelplans,Howmuchhasthepandemichadonyou,DiagnosedwithCOVID19,FearofgettingCOVID19,FearofgivingCOVID19tosomeoneelse,Worryingaboutpeopleotherthanmefriendsfamilypartnersetc,Stigmaordiscriminationfromotherpeople,Frustrationorboredom,Anxiety_A,Depression_A,Loneliness,Anger,Grieforfeelingsofloss,Changeinsleeppatternssleepingmoresleepinglessorotherchangesfromu,ConfusionaboutwhatCOVID19ishowtopreventitorwhysocialdistancingis,FeelingthatIwascontributingtothegreatergoodbypreventingmyselforo,Notgettingenoughemotionalorsocialsupportfromfamilyfriendspartner,Notgettingenoughfinancialsupportfromfamilyfriendspartnersanorgan,Notgettingenoughexercise,ConfusionaboutwheretogettrueandaccurateinformationaboutCOVID19,Difficultyobtainingamaskorfacecovering,Difficultywashingmyhandsasoftenasrecommended,Noneoftheabove,Changeinworkinghours,Other_ChangeinWorkStatus,WhatkindofChangeintravelplansdidyouface,SexualActivity,Toaccouse,Alcohol,Marijuana,Others,Foodintake,Useofscreens,Anyfinancialloss,Joblossorlaidoff,Lostorreducedwages,Investmentretirementloss,Travelrelatedcancellationsthatwerenotrefunded,Financialloss4,Other_Specified,spendmoretimetakingcareofpartnersorotherfamilymembers,Lossofothersourcesoffinancialsupport,Lossofyourhousingorbecominghomeless,Difficultypayingforbasicneedsincludingfoodclothingshelterelectri,worryaboutwhetherfoodwouldrunoutbeforegettingmoneyt,Didyouevercutthesizeofyourmealsorskipmealsbecausetherewasntenoug,Wereyoueverhungrybutdidnteatbecausetherewasntenoughmoneyforfood,Unabletoattendahealthcareprovidersappointment,Unabletoobtainmedicationsthatyoutake,Unabletoaffordmedicalcare,Changeintoothbrushing,Mouthulcers,criticalhealthneeds,accessingusualmedicalhealthcareservices,alternativemedicalcareservicestoaddressyourhealthneeds,healthcareproviderappointmentnotattended,MycliniccancelledmyappointmentbecauseofCOVID19,Ihadsymptomsofcoronavirussodidnotgo,Ifeltgoodsodidnotneedtogo,Didnthavethemoneyorinsurance,Hourslocationwasinconvenient,Iforgottogomissedmyappointment,Ifeltdisrespectedbytheofficeormedicalstaff,Ihaddifficultygettingtransportationtotheclinic,reason4,Other_Reasons,HowmuchhastheCOVID19pandemicinterruptedthecareyoureceiveforyourm,HowmuchhastheCOVID19pandemicinterruptedthecareyoureceiveforsubst,Healthservicesused_Inpersonvisit,Healthservicesused_Telehealthwithvideo,Healthservicesused_Overthephonenovideo,Healthservicesused_Emailorwrittencommunicatione.g.throughapatien,Healthservicesused_Notapplicable,Onascalefrom1lowestto10highesthowsociallyisolateddoyoufeelrightn,Feelingssocialisolation,Difficultykeepingawayfromphysical,QRmembersofthefamly,QRsignificantothers,QRfriends,PTSD1_Repeateddisturbingmemoriesthoughtsorimagesofastressfulexpe,PTSD2_Repeateddisturbingdreamsofastressfulexperiencefromthepast,PTSD3_Suddenlyactingorfeelingasifastressfulexperiencewerehappeni,PTSD4_Feelingveryupsetwhensomethingremindedyouofastressfulexperi,PTSD5_Havingphysicalreactionse.g.heartpoundingtroublebreathingsw,PTSD6_Avoidingthinkingaboutortalkingaboutastressfulexperiencefro,PTSD7_Avoidingactivitiesorsituationsbecausetheyremindedyouofastr,PTSD8_Troublerememberingimportantpartsofastressfulexperiencefrom,PTSD9_Lossofinterestinactivitiesthatyouusedtoenjoy,PTSD10_Feelingdistantorcutofffromotherpeople,PTSD11_Feelingemotionalnumborbeingunabletohavelovingfeelingsfort,PTSD12_Feelingasifyourfuturewillsomehowbecutshort,PTSD13_Troublefallingorstayingasleep,PTSD14_Feelingirritableorhavingangryoutbursts,PTSD15_Havingdifficultyconcentrating,PTSD16_Beingsuperalertorwatchfuloronguard,PTSD17_Feelingjumpyoreasilystartled,Ilookforcreativewaystoalterdifficultsituations,RegardlessofwhathappenstomeIbelieveIcancontrolmyreactiontoit,IbelieveIcangrowinpositivewaysbydealingwithdifficultsituations,Talktofriendsorfamilyonthephone,TalktofriendsorfamilythroughvideochatFacetimeSkypeZoomLineWhatsA,Talktofriendsorfamilyfacetofaceinperson,Spendtimewithpets,Meditateorothermindfulnesspractices,Exerciseinoraroundyourhome,Exerciseorspendleisuretimeoutdoorslikeataparkorwalkingtrail,Doyardworkorgardening,Participateincreativeactivitiesorhobbieswritingreadingartcrafts,Learnanewskillorengageindistantlearning,Takingbreaksfromthenewsorsocialmedia,V171,Other_Specified_A,Howdidyoulearnaboutthisstudy,ArethereotherchallengesyouhavefacedduringtheCOVID19pandemicthatw,Arethereotherstrengthsorresilienciesthatyouhavetappedintothatwed,WhatwastheyearofyourfirstHIVpositivetest,Whatisyourviralload,Ifyouknowyourviralloadhowmanycopiespermle.g.20copiesmL,WhatwasyourmostrecentCD4count,WhatwasthelowestCD4countyouveeverhadnadirCD4,Atthismomentdoyouhavea90daysupplyofyourHIVmedications,Didyouhavedifficultyobtaininga90daysupplyofHIVmedicationsduringC,Somepeoplefindthattheysometimesforgettotaketheirmedicationstoman,Reasonsnottakingthemediciations_CouldnotgetmyHIVmedicationsbecau,Reasonsnottakingthemediciations_Wantedtorationmymedicationtomake,Reasonsnottakingthemediciations_Feltgooddidnotneedthem,Reasonsnottakingthemediciations_CD4countandviralloadaregood,Reasonsnottakingthemediciations_Doctoradvisedmetodelaytreatment,Reasonsnottakingthemediciations_DontwanttothinkaboutbeingHIVposi,Reasonsnottakingthemediciations_Worriedaboutsideeffects,Reasonsnottakingthemediciations_Donthavemoneyorinsurancetogetmed,Reasonsnottakingthemediciations_Drinkingorusingdrugsanddidnotwan,Reasonsnottakingthemediciations_IjustrecentlyfoundoutIwasHIVposi,Reasonsnottakingthemediciations_Iforgottotakethem,Reasonsnottakingthemediciations_4,Current_work_status,totalPTSD,ageinyears,Male_notmale,Sex_nosex,Tobacco_notobacco,alcohol_noalcohol,Marijuana_nomarijuana,otherpsychoactivesubstances,Food_nofood,Screens_noscreens,worseningrelationship_family,worseningrelationship_others,worseningrelationship_friends,jobloss,reducedwages,heterosexual1_noneheterosexual
0,0,1,1,0,1996,Nigeria,3,9,0,3,3,Gender nonconforming,3,0,0,0,0,0,0,1,0,0,0,0,0,0,0,0,1,0,0,0,0,0,0,0,0,0,0,0,0,5,3,3,4,4,5,0,0,0,1,1,0,0,1,0,0,0,1,2,0,1,0,1,0,1,1,1,1,1,0,0,0,0,0,1,0,0,0,0,0,0, ,Cancelled travel plans,3,4,4,4,4,3,1,1,1,0,0,1,0, ,0,1,0,1,0,1,1,1,1,1,0,0,1,1,1,1,1,0,0,1,0,0,0,1,0, ,Somewhat,I don’t receive substance abuse addiction care, , ,Over the phone (no video), , ,1,3,2,2,3,2,2,2,2,2,3,2,4,2,3,2,3,4,3,4,3,3,2,4,4,4,0,0,0,0,0,0,0,0,1,1,0, , , ,No,No,2014,Do not know, ,Between 200 and 500,Less than 200,No,Yes,No, , , , , , , , , , , , ,0,46,24,0,1,0,0,0,0,1,1,1,0,1,1,0,0
0,0,0,0,0,1994,Nigeria,2,5,0,1,2,Woman,4,0,0,0,0,0,0,0,0,0,0,0,0,0,0,0,1,0,0,0,0,0,0,0,0,0,0,0,0,5,5,5,5,5,5,0,0,0,1,0,0,0,0,0,0,0,0,3,0,1,0,0,0,0,0,0,0,0,0,0,0,0,0,0,0,0,0,0,0,0, , ,3,4,4,4,4,1,2,1,0,0,0,0,0, , , , , , , , , , , , , , , , , ,0,0,0,0,0,0,0,0,0, , , , , , , , , , , ,6,6,6, , , , , , , , , , , , , , , , , , , , ,0,0,0,0,0,0,0,0,0,0,0, , , , , , , , , , , , , , , , , , , , , , , , , ,2, ,26,0,1,0,0,0,0,1,1,0,0,0,0,0,0
0,0,0,0,1,1982,Nigeria,3,3,0,2,2,Woman,4,0,0,0,0,0,0,0,0,0,0,0,0,0,0,0,1,0,0,0,0,0,0,0,0,0,0,0,0,2,4,4,2,2,4,0,1,0,1,1,0,0,0,0,0,0,0,1,0,0,0,0,0,0,0,0,0,0,0,0,1,0,0,0,0,0,0,0,0,0, , ,3,4,4,4,4,1,1,1,0,0,0,0,1,Business breakdown,1,1, ,1,1,1,1,1,1,1, , , , , , ,0,0,0,0,0,0,0,0,0, , , , , , , , , , , ,6,6,6, , , , , , , , , , , , , , , , , , , , ,0,0,0,0,0,0,0,0,0,0,0, , , , , , , , , , , , , , , , , , , , , , , , , ,4, ,38,0,1,0,0,0,0,1,1,0,0,0,0,0,0
0,1,0,0,0,1991,Nigeria,3,9,0,1,2,Woman,4,0,0,0,1,0,0,0,0,0,0,0,0,0,0,0,0,0,1,0,0,0,0,0,0,0,0,0,0,5,5,4,1,1,4,0,1,0,1,1,0,0,0,0,0,0,0,2,0,1,0,0,0,0,0,0,0,0,0,0,1,0,0,0,0,0,0,0,0,0, , ,4,4,4,4,4,3,3,1,0,0,0,0,0, , , , , , , , , , , , , , , , , ,0,0,0,0,0,0,0,0,0, , , , , , , , , , , ,6,6,6, , , , , , , , , , , , , , , , , , , , ,0,0,0,0,0,0,0,0,0,0,0, , , , , , , , , , , , , , , , , , , , , , , , , ,0, ,29,0,0,0,0,0,0,1,1,0,0,0,0,0,0
0,0,0,0,0,1996,Nigeria,3,4,1,1,2,Woman,4,1,0,0,0,0,0,0,0,0,0,0,0,0,0,0,0,0,0,0,0,0,0,0,0,0,0,0,0,5,5,5,5,5,5,0,0,0,0,0,0,0,0,0,0,0,0, ,0,0,0,0,0,0,0,0,0,0,0,0,0,0,0,0,0,0,0,0,0,0, , ,4,4,4,4,4,4,4, ,0,0,0,0,0, , , , , , , , , , , , , , , , , ,0,0,0,0,0,0,0,0,0, , , , , , , , , , , ,6,6,6, , , , , , , , , , , , , , , , , , , , ,0,0,0,0,0,0,0,0,0,0,0, , , , , , , , , , , , , , , , , , , , , , , , , ,1, ,24,0,0,0,0,0,0,0,0,0,0,0,0,0,0
0,0,0,1,0,1962,Nigeria,3,6,0,2,2,Woman,4,1,0,0,0,0,0,0,0,0,0,0,0,0,0,0,0,0,0,0,0,0,0,0,0,0,0,0,0,3,3,3,3,3,3,0,1,0,1,1,0,0,0,1,0,0,1,3,0,0,0,0,0,1,0,0,0,0,0,1,0,1,0,0,0,1,0,0,0,0, ,Cancelled travel plans,3,4,4,4,4,3,2,1,0,0,0,0,0, , , , , , , , , , , , , , , , , ,0,0,0,0,0,0,0,0,0, , , , , , , , , , , ,6,6,6, , , , , , , , , , , , , , , , , , , , ,0,0,0,0,0,0,0,0,0,0,0, , , , , , , , , , , , , , , , , , , , , , , , , ,3, ,58,0,1,0,0,0,0,1,1,0,0,0,0,0,0
0,0,0,0,0,1967,Nigeria,3,1,2,2,2,Woman,4,0,0,0,0,0,0,0,0,0,0,0,0,0,0,0,0,0,0,0,0,0,0,0,0,0,0,0,0, , , , , , ,0,0,0,0,0,0,0,0,0,0,0,0, ,0,0,0,0,0,0,0,0,0,0,0,0,0,0,0,0,0,0,0,0,0,0, , ,4,4,4,4,4,4,4, ,0,0,0,0,0, , , , , , , , , , , , , , , , , ,0,0,0,0,0,0,0,0,0, , , , , , , , , , , ,6,6,6, , , , , , , , , , , , , , , , , , , , ,0,0,0,0,0,0,0,0,0,0,0, , , , , , , , , , , , , , , , , , , , , , , , , ,1, ,53,0,0,0,0,0,0,0,0,0,0,0,0,0,0
0,0,0,0,0,1972,Nigeria,3,1,0,2,2,Woman,4,1,0,0,0,0,0,0,0,0,0,0,0,0,0,0,0,0,0,0,0,0,0,0,0,0,0,0,0,3,3,3,3,3,3,0,0,0,1,1,0,0,0,0,0,0,0,1,0,0,0,0,0,0,0,0,0,0,0,0,0,0,0,0,0,0,0,0,1,0, , ,4,4,4,4,4,4,2,0,0,0,0,0,0, , , , , , , , , , , , , , , , , ,0,0,0,0,0,0,0,0,0, , , , , , , , , , , ,6,6,6, , , , , , , , , , , , , , , , , , , , ,0,0,0,0,0,0,0,0,0,0,0, , , , , , , , , , , , , , , , , , , , , , , , , ,1, ,48,0,0,0,0,0,0,0,1,0,0,0,0,0,0
0,0,0,0,0,1989,Nigeria,3,2,0,1,2,Woman,4,1,0,0,0,0,0,0,0,0,0,0,0,0,0,0,0,0,0,0,0,0,0,0,0,0,0,0,0,5,5,5,5,5,5,0,1,0,0,0,0,0,0,0,0,0,0,5,0,1,0,0,0,0,0,0,0,0,0,0,0,0,0,0,0,0,0,0,0,0, , ,4,4,4,4,4,3,2,1,0,1,0,0,0, ,0,1,0,1,0,0,0,0,0,0,0,0,0,0,0,0,0,0,0,0,0,0,0,0,0, ,I don’t receive mental health care,Not at all, , , , ,Not applicable,5,3,3,3,3,3, , , , , , , , , , , , , , , , , , , , ,0,0,0,0,0,0,0,0,0,0,0, , , , , , , , , , , , , , , , , , , , , , , , , ,1, ,31,0,0,0,0,0,0,1,1,0,0,0,0,1,0
0,1,0,0,0,1968,Nigeria,3,1,0,2,2,Woman,4,0,0,0,0,0,0,0,0,0,0,0,0,0,0,0,0,0,1,0,0,0,0,0,0,0,0,0,0,3,5,3,4,4,3,0,1,0,1,1,0,0,0,0,1,1,1,5,0,1,0,1,1,1,1,0,0,1,1,1,1,0,1,1,0,0,0,0,0,2, ,Cancelled travel plans,2,4,1,4,1,2,2,1,0,1,0,1,0, ,1,1,0,1,1,1,1,1,1,1,1,0,1,1,1,1,1,0,0,1,1,0,1,0,0, ,Not at all,Not at all, , ,Over the phone (no video), , , , , ,6,6,6, , , , , , , , , , , , , , , , , , , , ,0,0,0,0,0,0,0,0,0,0,0, , , , , , , , , , , , , , , , , , , , , , , , , ,1, ,52,0,1,0,1,0,1,1,1,0,0,0,0,1,0
0,0,0,0,0,1993,Nigeria,2,5,0,1,2,4,4,0,0,0,0,0,0,0,0,0,0,0,0,0,0,0,0,0,0,0,0,0,0,0,0,0,0,0,0, , , , , , ,0,0,0,0,0,0,0,0,0,0,0,0, ,0,0,0,0,0,0,0,0,0,0,0,0,0,0,0,0,0,0,0,0,0,0, , ,4,4,4,4,4,4,4, ,0,0,0,0,0, , , , , , , , , , , , , , , , , ,0,0,0,0,0,0,0,0,0, , , , , , , , , , , ,6,6,6, , , , , , , , , , , , , , , , , , , , ,0,0,0,0,0,0,0,0,0,0,0, , , , , , , , , , , , , , , , , , , , , , , , , ,2, ,27,0,0,0,0,0,0,0,0,0,0,0,0,0,0
0,0,0,0,0,1992,Nigeria,3,9,0,1,2,Woman,4,0,0,0,0,0,0,0,0,0,0,0,0,0,0,0,0,0,1,0,0,0,0,0,0,1,0,0,0,4,5,5,4,5,4,0,1,0,0,0,0,0,0,0,0,0,0,1,0,0,0,0,0,0,0,0,0,0,0,0,0,0,0,1,0,0,0,0,0,0, , ,2,4,4,4,4,2,2,1,0,0,0,0,0, , , , , , , , , , , , , , , , , ,0,0,0,0,0,0,0,0,0, , , , , , , , , , , ,6,6,6, , , , , , , , , , , , , , , , , , , , ,0,0,0,0,0,0,0,0,0,0,0, , , , , , , , , , , , , , , , , , , , , , , , , ,0, ,28,0,1,0,0,0,0,1,1,0,0,0,0,0,0
0,0,0,0,0,1977,Nigeria,3,1,0,1,2,Woman,4,0,0,0,0,0,0,0,0,0,0,0,0,0,0,0,1,0,0,0,0,0,0,0,0,0,0,0,0,5,5,5,5,5,5,0,1,0,1,1,0,0,0,0,0,0,0,4,0,1,0,1,0,0,0,0,0,0,0,0,0,0,0,0,0,0,0,0,0,0, , ,4,4,4,4,4,2,2,0,0,0,0,0,0, , , , , , , , , , , ,2,0,0,0,0,0,0,0,0,0,0,0,0,0,0, ,I don’t receive mental health care,I don’t receive substance abuse addiction care, , , , ,Not applicable,0,3,1,3,3,3,1,1,1,1,1,1,1,1,1,1,1,1,1,1,1,1,1,4,4,5,1,1,1,0,0,1,0,0,0,0,0, , , ,No,No,2007,Detectable,20 copies,Between 200 and 500,Between 200 and 500,Yes,No,No, , , , , , , , , , , , ,1,17,43,0,0,0,0,0,0,1,1,0,0,0,0,0,0
0,0,1,1,0,1980,Nigeria,3,1,2,2,2,Woman,4,1,0,0,0,0,0,0,0,0,0,0,0,0,0,0,0,0,0,0,0,0,0,0,0,0,0,0,0,3,3,3,3,3,3,0,1,0,1,1,0,0,0,0,0,0,1,4,0,1,0,1,0,0,0,0,0,0,0,0,0,0,0,0,0,0,0,0,0,0, ,Cancelled travel plans,3,4,4,4,4,3,3,2,0,0,0,0,0, , , , , , , , , , , ,0,0,0,0,0,0,0,0,0,0,0,0,0,0,0, ,Not at all,I don’t receive substance abuse addiction care, , ,Over the phone (no video), , ,3,2,3,6,6,6,1,1,1,1,1,1,1,1,1,1,1,1,1,1,1,1,1,4,5,5,1,1,0,0,0,1,0,0,0,0,0, , ,WhatsApp,Not at all,Not at all, , , , , , , , , , , , , , , , , , , , ,1,17,40,0,1,0,0,0,0,1,1,0,0,0,0,0,0
0,0,0,0,0,1989,Nigeria,3,1,0,1,2,Woman,4,1,0,0,0,0,0,0,0,0,0,0,0,0,0,0,0,0,0,0,0,0,0,0,0,0,0,0,0,3,3,3,3,3,3,0,1,0,1,1,0,0,0,0,0,0,0,4,0,0,0,0,0,0,0,0,0,0,0,0,0,0,0,0,1,0,0,0,0,0, , ,3,4,4,4,4,1,2,0,0,0,0,0,0, , , , , , , , , , , , , ,0,0,3,2,0,0,0,0,0,0,0,0,0, ,I don’t receive mental health care,I don’t receive substance abuse addiction care, , , , ,Not applicable,6,3,2,3,6,3,1,1,1,1,1,1,1,1,1,1,1,1,1,1,1,1,1,4,3,4,1,1,0,0,0,1,0,0,1,0,0, , , , , , , , , , , , , , , , , , , , , , , , , ,1,17,31,0,1,0,0,0,0,1,1,0,0,0,0,0,0
0,0,0,0,0,1957,Nigeria,3,6,0,5,2,Woman,4,0,0,0,0,0,0,0,0,1,0,0,0,0,0,1,0,0,0,0,0,0,0,0,0,0,0,0,0,2,4,2,2,2,2,0,1,0,1,1,0,0,0,1,0,0,0,2,0,1,0,0,0,0,0,0,0,0,0,0,0,0,0,1,0,0,0,0,0,0, , ,4,4,4,4,4,3,3,1,0,0,0,0,1,business loss.,0,1,1,1,1,1,1,1,1,1,0,0,0,0,0,2,0,0,0,0,0,0,0,0,0, ,I don’t receive mental health care,I don’t receive substance abuse addiction care, , , , ,Not applicable,6,1,1,3,6,3,1,1,1,1,1,1,1,1,1,1,1,1,1,1,1,1,1,1,1,1,1,1,1,0,0,0,0,0,0,0,0, , , , , , , , , , , , , , , , , , , , , , , , , ,3,17,63,0,0,0,0,0,0,1,1,0,0,0,0,0,0
0,0,0,0,0,1976,Nigeria,3,1,2,2,2,Woman,4,1,0,0,0,0,0,0,0,0,0,0,0,0,0,0,0,0,0,0,0,0,0,0,0,0,0,0,0,3,3,3,3,3,3,0,0,0,1,1,0,0,0,0,0,0,0,4,0,1,0,1,0,0,0,0,0,0,0,0,0,0,0,0,0,0,1,0,0,0, , ,3,4,3,4,4,3,3,2,0,0,0,0,0, , , , , , , , , , , ,0,0,0,1,0,0,0,0,0,0,0,0,0,0,0, ,I don’t receive mental health care,I don’t receive substance abuse addiction care, , , , ,Not applicable,5,3,4,3,3,3,1,1,1,1,1,1,1,1,1,1,1,1,1,1,1,1,1,1,5,5,1,1,0,0,0,1,1,0,1,0,0, , , ,None,Spent more time with my husband and children., , , , , , , , , , , , , , , , , , , , ,1,17,44,0,1,0,1,0,0,1,1,0,0,0,0,0,0
0,0,0,1,0,1949,Nigeria,3,4,2,2,2,Woman,4,0,0,0,1,0,0,0,0,0,0,0,0,0,0,0,0,0,0,0,0,0,0,0,0,0,0,0,0,3,3,3,3,3,3,0,1,0,0,0,0,0,0,0,0,0,0,4,0,1,0,0,0,0,0,0,0,0,0,0,0,0,0,0,0,0,0,0,0,0, , ,3,4,4,4,4,3,3,1,0,1,0,0,0, ,0,0,0,0,0,0,0,0,0,0,0,0,0,0,0,0,0,0,0,0,0,0,0,0,0, ,I don’t receive mental health care,I don’t receive substance abuse addiction care, , , , ,Not applicable,2,3,1,3,3,3,1,1,1,1,1,1,1,1,1,1,1,1,1,1,1,1,1,3,2,2,0,0,0,0,0,1,0,0,0,0,0, , , ,None,None, , , , , , , , , , , , , , , , , , , , ,1,17,71,0,1,0,0,0,0,1,1,0,0,0,0,1,0
0,0,1,0,0,1983,Nigeria,3,1,2,1,2,Woman,4,0,0,0,0,0,0,0,0,0,0,0,0,0,0,0,1,0,0,0,0,0,0,0,0,0,0,0,0,3,3,3,3,3,3,0,1,0,1,1,0,1,0,1,0,0,0,3,0,0,0,1,0,0,0,0,0,0,0,0,0,0,0,0,0,0,0,0,0,0, , ,4,4,3,4,4,3,3,1,0,1,1,0,0, ,0,1,0,0,1,0,0,1,0,0,0,0,0,1,1,0,0,0,0,0,0,0,0,0,0, ,I don’t receive mental health care,I don’t receive substance abuse addiction care, , , , ,Not applicable,5,2,1,5,6,4,1,1,1,1,1,1,2,1,1,1,1,1,1,1,1,1,1,4,4,4,1,1,1,0,1,1,0,0,1,1,1, , ,Personal invitation,No,Prayer,2013,Undetectable, ,Between 200 and 500,Do not know,Yes,Yes,No, , , , , , , , , , , , ,1,18,37,0,0,0,1,0,0,1,1,0,0,0,0,1,0
0,0,0,0,0,1977,Nigeria,3,1,0,1,2,Woman,4,0,0,0,0,0,0,0,0,0,0,0,0,0,0,0,1,0,0,0,0,0,0,0,0,0,0,0,0,5,5,5,5,5,5,0,1,0,1,1,0,1,0,0,0,0,0,3,0,1,0,1,0,0,0,0,0,0,0,0,0,0,0,0,0,0,0,0,0,0, , ,4,4,4,4,4,3,2,1,0,0,0,0,1,"No business, no sales",0,0,0,0,1,1,1,0,0,0,0,0,0,0,0,0,0,0,0,0,0,0,0,0,0, ,Not at all,I don’t receive substance abuse addiction care, , , , ,Not applicable,5,3,2,6,6,6,1,1,1,1,1,1,1,1,1,1,1,1,1,1,1,2,1,4,4,4,1,1,0,0,1,1,0,0,1,0,0, , , ,No,No,2007,Detectable,20copies,Between 200 and 500,Between 200 and 500,Yes,No,No, , , , , , , , , , , , ,1,18,43,0,0,0,0,0,0,1,1,0,0,0,0,0,0
0,0,0,0,0,1989,Nigeria,3,1,0,1,2,Woman,4,1,0,0,0,0,0,0,0,0,0,0,0,0,0,0,0,0,0,0,0,0,0,0,0,0,0,0,0,5,5,5,5,5,5,0,1,0,1,1,0,0,0,1,0,0,1,2,0,0,0,0,0,0,0,0,0,0,0,0,0,1,0,1,0,0,0,0,0,0, ,Cancelled travel plans,4,4,4,4,4,2,2,2,0,0,0,0,0, , , , , , , , , , , , , ,0,0,0,0,0,0,0,0,0,0,0,0,0, ,I don’t receive mental health care,I don’t receive substance abuse addiction care, , , , ,Not applicable,8,1,2,5,6,6,1,1,1,1,1,1,1,1,1,2,1,1,1,1,1,1,1,2,4,4,1,1,0,0,0,1,0,0,1,0,0, , , ,No,No, , , , , , , , , , , , , , , , , , , , ,1,18,31,0,0,0,0,0,0,1,1,0,0,0,0,0,0
0,0,1,0,0,1985,Nigeria,3,1,0,2,2,Woman,4,1,0,0,0,0,0,0,0,0,0,0,0,0,0,0,0,0,0,0,0,0,0,0,0,0,0,0,0,3,3,3,3,3,3,0,1,0,1,1,0,1,0,0,0,0,0,2,0,0,0,0,0,0,0,0,0,0,0,0,0,0,0,0,0,0,0,0,1,0, , ,3,4,4,4,4,3,3,2,0,0,0,0,0, , , , , , , , , , , ,0,0,0,3,3,2,0,0,0,0,0,0,0,0,0, ,I don’t receive mental health care,I don’t receive substance abuse addiction care, , , , ,Not applicable,1,2,3,3,3,3,1,1,1,1,1,1,1,1,1,1,1,1,1,1,1,1,2,4,3,4,1,1,1,1,1,0,0,1,0,0,0, , , ,No,No, , , , , , , , , , , , , , , , , , , , ,1,18,35,0,1,0,0,0,0,1,1,0,0,0,0,0,0
0,0,0,0,0,1984,Nigeria,3,2,0,2,2,Woman,4,1,0,0,0,0,0,0,0,0,0,0,0,0,0,0,0,0,0,0,0,0,0,0,0,0,0,0,0,3,3,3,3,3,3,0,1,0,1,0,0,1,1,1,0,0,0,2,0,0,0,1,0,0,0,0,0,0,0,0,0,1,0,0,0,1,0,0,0,0, , ,3,4,4,4,4,3,3,0,0,0,0,0,0, , , , , , , , , , , ,0,0,0,1,0,0,0,0,0,0,0,0,0,0,0, ,Somewhat,I don’t receive substance abuse addiction care,In-person visit, ,Over the phone (no video), , ,2,2,2,3,3,3,1,1,1,1,1,1,1,1,1,1,1,1,1,1,2,4,1,4,4,4,1,1,1,0,1,0,0,0,1,0,0, , , ,No,No, , , , , , , , , , , , , , , , , , , , ,1,21,36,0,1,0,0,0,0,1,1,0,0,0,0,0,0
0,0,0,1,0,1984,Nigeria,3,1,2,2,2,Woman,4,1,0,0,0,0,0,0,0,0,0,0,0,0,0,0,0,0,0,0,0,0,0,0,0,0,0,0,0,3,3,3,3,3,3,0,1,0,1,1,0,0,0,1,0,0,1,5,0,0,0,0,0,0,0,0,0,0,0,0,0,0,0,0,1,0,0,0,0,0, ,Cancelled travel plans,2,4,4,4,4,2,2,0,0,0,0,0,0, , , , , , , , , , , ,0,0,0,0,3,2,0,0,0,0,0,0,0,0,0, ,I don’t receive mental health care,I don’t receive substance abuse addiction care, , , , ,Not applicable,1,3,3,5,5,3,1,1,1,1,1,1,1,1,1,3,1,1,1,1,1,3,1,4,4,3,0,0,0,0,1,0,0,0,0,0,0, , , ,No,Good health, , , , , , , , , , , , , , , , , , , , ,1,21,36,0,1,0,0,0,0,1,1,0,0,0,0,0,0
0,0,0,1,0,1966,Nigeria,3,1,2,2,2,4,4,0,0,1,0,0,0,0,0,0,0,0,0,0,0,0,0,0,0,0,0,0,0,0,0,0,0,0,0,3,3,3,3,4,3,0,1,0,1,1,0,1,1,0,0,0,0,5,0,0,0,1,0,0,1,0,0,0,0,0,0,1,0,0,1,0,0,0,0,0, , ,1,4,4,4,4,2,2,1,0,0,0,1,0, ,0,0,0,0,0,0,0,0,0,0,2,0,0,0,0,0,0,0,0,0,0,0,0,0,0, ,I don’t receive mental health care,I don’t receive substance abuse addiction care, , , , ,Not applicable,3,2,2,3,5,3,1,1,1,1,2,1,1,1,2,1,1,1,2,1,1,3,1,4,4,4,1,1,1,0,1,1,1,1,1,0,0, , , ,Spending much on food because the children are at home,No, , , , , , , , , , , , , , , , , , , , ,1,22,54,0,1,0,0,0,0,1,1,0,0,0,0,0,0
0,0,0,1,0,1992,Nigeria,3,7,0,2,2,Woman,4,1,0,0,0,0,0,0,0,0,0,0,0,0,0,0,0,0,0,0,0,0,0,0,0,0,0,0,0,3,5,4,3,3,4,0,1,0,1,1,0,0,0,1,0,0,0,3,0,1,0,0,0,0,0,0,0,0,0,0,0,0,0,0,0,0,0,0,0,0, , ,3,4,4,4,4,2,3,1,1,0,0,0,0, ,1,1,0,1,1,1,1,0,0,0,2,0,0,3,3,2,0,0,0,0,0,0,0,0,0, ,I don’t receive mental health care,I don’t receive substance abuse addiction care, , , , ,Not applicable,7,1,1,5,4,2,2,2,2,1,1,2,2,1,1,1,1,1,1,1,1,1,1,4,4,4,1,1,0,0,0,1,0,0,0,0,0, , , ,No,No, , , , , , , , , , , , , , , , , , , , ,0,22,28,0,1,0,0,0,0,1,1,0,0,1,1,0,0
0,0,0,1,0,1971,Nigeria,3,1,0,2,2,Woman,4,0,0,0,0,0,0,0,0,0,0,0,0,0,0,0,0,0,1,0,0,0,0,0,0,0,0,0,0,5,5,4,5,5,4,0,1,0,1,1,0,0,0,0,0,0,0,4,0,1,0,0,0,0,0,0,0,0,0,0,0,0,0,0,1,0,0,0,0,0, , ,1,4,4,4,4,2,2,1,0,0,0,1,0, ,1,1,0,0,1,1,1,1,0,0,0,0,0,1,1,1,0,0,0,0,0,1,0,0,0, ,I don’t receive mental health care,Not at all,In-person visit, , , , ,7,3,3,5,5,2,1,1,1,2,1,1,1,1,2,3,1,1,1,2,1,3,1,2,3,2,1,0,0,0,0,0,0,0,0,1,0, , , ,No,No, , , , , , , , , , , , , , , , , , , , ,1,24,49,0,1,0,0,0,0,1,1,0,0,1,0,0,0
0,0,0,0,1,1983,Nigeria,2,2,0,1,2,Woman,4,0,0,0,0,0,0,0,0,0,0,0,0,0,0,0,1,0,0,0,0,0,0,0,0,0,0,0,0,5,5,5,5,3,5,0,1,0,0,0,0,0,0,0,0,0,0,5,0,1,0,0,0,0,0,0,0,0,0,0,0,0,0,0,0,0,0,0,0,0, , ,2,4,4,4,4,3,2,1,0,0,0,1,0, ,1,1,1,1,1,1,1,0,0,0, , ,0,0,0,2,0,0,0,0,0,0,0,0,0, ,Not at all,Not at all, , ,Over the phone (no video), , ,9,3,4,5,4,5,1,1,1,1,1,1,1,2,3,2,4,1,1,1,1,2,1,2,3,5,1,0,0,0,0,0,0,0,0,0,0, , , ,No,No,2008,Undetectable,3,Do not know,Less than 200,Yes,No,No, , , , , , , , , , , , ,1,25,37,0,1,0,0,0,0,1,1,0,0,0,0,0,0
0,0,0,1,0,1970,Nigeria,3,1,0,1,2,Woman,4,1,0,0,0,0,0,0,0,0,0,0,0,0,0,0,0,0,0,0,0,0,0,0,0,0,0,0,0,3,3,3,3,3,3,0,1,0,0,1,0,0,0,1,0,0,1,2,0,0,0,0,0,0,0,0,0,0,0,0,0,0,0,0,1,0,0,0,0,0, ,Cancelled travel plans,4,4,4,4,4,2,2,0,0,0,0,0,0, , , , , , , , , , , ,0,0,0,1,0,2,0,0,0,0,0,0,0,0,0, ,I don’t receive mental health care,I don’t receive substance abuse addiction care, , , , ,Not applicable,0,2,1,5,6,3,2,2,1,4,1,2,1,1,1,2,1,1,1,1,1,2,1,4,5,4,1,1,1,0,0,0,0,0,0,0,0, , ,Personal invitation,Not really,"Stable in listening more,and also more proactive in doing things.", , , , , , , , , , , , , , , , , , , , ,1,25,50,0,0,0,0,0,0,1,1,0,0,0,0,0,0
0,0,0,0,0,1979,Nigeria,2,4,0,4,2,Woman,4,0,0,0,0,0,0,0,0,0,0,0,0,0,0,0,1,0,0,0,0,0,0,0,0,0,0,0,0,4,4,3,5,5,5,0,1,0,1,1,0,0,0,0,0,0,0,4,0,1,0,0,0,0,0,0,0,0,0,0,0,0,0,0,0,0,0,0,0,0, , ,1,3,3,3,3,3,4,1,0,1,0,0,0, ,1,1,0,1,1,1,1,1,1,1,0,0,0,1,0,1,0,0,0,0,1,0,0,1,0, ,Not at all,Not at all,In-person visit, ,Over the phone (no video), , ,3,2,3,2,3,4,1,1,2,2,1,1,3,2,1,2,3,1,1,1,1,2,1,3,3,3,0,1,1,0,0,0,0,0,0,0,0, , , ,No,No,2019,Do not know, ,Between 200 and 500,More than 500,Yes,Yes,No, , , , , , , , , , , , ,1,26,41,0,1,1,1,1,1,1,0,1,0,0,0,1,0
0,0,1,0,0,1978,Nigeria,3,1,2,2,2,Woman,4,0,0,0,0,0,0,0,0,0,0,0,0,0,0,0,0,0,0,0,0,0,0,0,0,0,0,0,0,3,3,3,3,3,3,0,1,0,0,0,0,1,0,0,0,0,0,4,1,0,0,0,0,0,0,0,0,0,0,0,0,0,0,0,1,0,0,1,0,0, , ,3,4,4,4,4,2,2,1,0,1,0,0,0, ,1,1,0,0,0,0,0,0,0,0, , ,0,1,0,2,0,0,0,0,0,0,0,0,0, ,I don’t receive mental health care,I don’t receive substance abuse addiction care, , , , ,Not applicable,8,3,2,3,2,3,1,1,1,2,2,2,2,3,1,2,2,1,1,2,1,4,2,4,4,4,0,1,0,0,0,0,0,0,0,0,0, , , ,No,No, , , , , , , , , , , , , , , , , , , , ,1,30,42,0,1,0,0,0,0,1,1,0,1,0,0,1,0